BDBM50151131 4,4,7,8-Tetramethyl-4,10-dihydro-benzo[4,5]imidazo[1,2-a][1,3,5]triazin-2-ylamine::CHEMBL185800
SMILES Cc1cc2nc3N=C(N)NC(C)(C)n3c2cc1C
InChI Key InChIKey=LEFFLPPLRAOVAW-UHFFFAOYSA-N
Data  1 KI
  Tab Delimited (TSV)   2D SDfile   Computed 3D by Vconf -m prep SDfile
Find this compound or compounds like it in BindingDB:
Activity Spreadsheet -- Enzyme Inhibition Constant Data from BindingDB
Found 1 hit for monomerid = 50151131
TargetBifunctional dihydrofolate reductase-thymidylate synthase(Plasmodium falciparum (isolate K1 / Thailand))
Università
Curated by ChEMBL
LigandPNGBDBM50151131(4,4,7,8-Tetramethyl-4,10-dihydro-benzo[4,5]imidazo...)
Affinity DataKi:  180nM. Assay description: Inhibition constant against Plasmodium falciparum dihydrofolate reductaseChecked by Author
In DepthDetails ArticlePubMed