BDBM50151312 CHEMBL3769612
SMILES Cc1ccc(C)c(c1)N1CCN(CC(O)CN2C(=O)NC(C)(C2=O)c2ccc(F)cc2)CC1
InChI Key InChIKey=HKFCZKONZLVXFH-UHFFFAOYSA-N
Data  3 KI  1 IC50
  Tab Delimited (TSV)   2D SDfile   Computed 3D by Vconf -m prep SDfile
Find this compound or compounds like it in BindingDB:
Activity Spreadsheet -- Enzyme Inhibition Constant Data from BindingDB
Found 4 hits for monomerid = 50151312
Target5-hydroxytryptamine receptor 7(Homo sapiens (Human))
Jagiellonian University Medical College
Curated by ChEMBL
LigandPNGBDBM50151312(CHEMBL3769612)
Affinity DataKi:  56nM. Assay description: Displacement of [3H]-5-CT from human 5-HT7 receptor expressed in HEK293 cells
In DepthDetails ArticlePubMed
Target5-hydroxytryptamine receptor 1A(Homo sapiens (Human))
Jagiellonian University Medical College
Curated by ChEMBL
LigandPNGBDBM50151312(CHEMBL3769612)
Affinity DataKi:  1.30E+3nM. Assay description: Displacement of [3H]-8-OH-DPAT from human 5-HT1A receptor expressed in HEK293 cells
In DepthDetails ArticlePubMed
TargetD(2) dopamine receptor(Homo sapiens (Human))
Jagiellonian University Medical College
Curated by ChEMBL
LigandPNGBDBM50151312(CHEMBL3769612)
Affinity DataKi:  1.81E+3nM. Assay description: Displacement of [3H]-Raclopride from human dopamine D2L receptor expressed in HEK293 cells
In DepthDetails ArticlePubMed
Target5-hydroxytryptamine receptor 7(Homo sapiens (Human))
Jagiellonian University Medical College
Curated by ChEMBL
LigandPNGBDBM50151312(CHEMBL3769612)
Affinity DataIC50:  1.01E+3nM. Assay description: Antagonist activity at human 5-HT7 receptor expressed in HEK293 cells assessed as inhibition of 5-CT-induced cAMP production preincubated for 15 mins...
In DepthDetails ArticlePubMed