BDBM50152607 CHEMBL3780230
SMILES COCCN[C@H]1CC[C@H](CC1)Nc1cc[nH]c(=O)c1-c1nc2ccccc2[nH]1
InChI Key InChIKey=SAPSNDTWQKTUDL-GASCZTMLSA-N
Data  1 IC50
  Tab Delimited (TSV)   2D SDfile   Computed 3D by Vconf -m prep SDfile
Find this compound or compounds like it in BindingDB:
Activity Spreadsheet -- Enzyme Inhibition Constant Data from BindingDB
Found 1 hit for monomerid = 50152607
TargetTyrosine-protein kinase JAK1(Homo sapiens (Human))
Merck
Curated by ChEMBL
LigandPNGBDBM50152607(CHEMBL3780230)
Affinity DataIC50:  0.800nM. Assay description: Inhibition of JAK1 (unknown origin)
In DepthDetails ArticlePubMed