BDBM50153081 CHEMBL365910::N-((3S,6R)-3-tert-Butyl-2,5-dioxo-1,4diaza-cycloicos-6-ylmethyl)-N-hydroxy-formamide
SMILES CC(C)(C)[C@@H]1NC(=O)[C@@H](CN(O)C=O)CCCCCCCCCCCCCCNC1=O
InChI Key InChIKey=RANUWAUPDVMUKD-NHCUHLMSSA-N
Data  2 KI
  Tab Delimited (TSV)   2D SDfile   Computed 3D by Vconf -m prep SDfile
Find this compound or compounds like it in BindingDB:
Activity Spreadsheet -- Enzyme Inhibition Constant Data from BindingDB
Found 2 hits for monomerid = 50153081
TargetPeptide deformylase(Escherichia coli)
The Ohio State University
Curated by ChEMBL
LigandPNGBDBM50153081(CHEMBL365910 | N-((3S,6R)-3-tert-Butyl-2,5-dioxo-1...)
Affinity DataKi:  25nM. Assay description: Inhibitory effect against E. coli peptide deformylase (PDF) by AAP assay
In DepthDetails ArticlePubMed
TargetPeptide deformylase(Escherichia coli)
The Ohio State University
Curated by ChEMBL
LigandPNGBDBM50153081(CHEMBL365910 | N-((3S,6R)-3-tert-Butyl-2,5-dioxo-1...)
Affinity DataKi:  2.10E+3nM. Assay description: Inhibitory effect against E. coli peptide deformylase (PDF) by DPPI assay
In DepthDetails ArticlePubMed