BDBM50153243 Biphenyl-4-carboxylic acid [4-(2-dimethylamino-ethylcarbamoyl)-phenyl]-amide::CHEMBL186601
SMILES CN(C)CCNC(=O)c1ccc(NC(=O)c2ccc(cc2)-c2ccccc2)cc1
InChI Key InChIKey=AJQUGUQYKMEIFI-UHFFFAOYSA-N
Data  1 IC50
  Tab Delimited (TSV)   2D SDfile   Computed 3D by Vconf -m prep SDfile
Find this compound or compounds like it in BindingDB:
Activity Spreadsheet -- Enzyme Inhibition Constant Data from BindingDB
Found 1 hit for monomerid = 50153243
TargetMelanin-concentrating hormone receptor 1(Homo sapiens (Human))
7Tm Pharma
Curated by ChEMBL
LigandPNGBDBM50153243(Biphenyl-4-carboxylic acid [4-(2-dimethylamino-eth...)
Affinity DataIC50: >1.00E+5nM. Assay description: Binding affinity against human Melanin-concentrating hormone receptor 1 stably transfected CHO cells was determined using [125I]-MCH as radioligand
In DepthDetails ArticlePubMed