BDBM50153630 5-[2-(3-Naphthalen-2-yl-8-aza-bicyclo[3.2.1]oct-2-en-8-yl)-ethoxy]-quinoline::CHEMBL187329
SMILES C(CN1C2CCC1C=C(C2)c1ccc2ccccc2c1)Oc1cccc2ncccc12
InChI Key InChIKey=CNRWYKRQNMMFHH-UHFFFAOYSA-N
Data  1 KI
  Tab Delimited (TSV)   2D SDfile   Computed 3D by Vconf -m prep SDfile
Find this compound or compounds like it in BindingDB:
Activity Spreadsheet -- Enzyme Inhibition Constant Data from BindingDB
Found 1 hit for monomerid = 50153630
TargetSodium-dependent serotonin transporter(Rattus norvegicus (rat))
Wyeth Research
Curated by ChEMBL
LigandPNGBDBM50153630(5-[2-(3-Naphthalen-2-yl-8-aza-bicyclo[3.2.1]oct-2-...)
Affinity DataKi:  0.400nM. Assay description: In vitro binding affinity for serotonin transporter
In DepthDetails ArticlePubMed