BDBM50153705 CHEMBL3774494
SMILES CC(C)CN1CCc2cc(O)ccc2[C@@]1(C)c1ccc(\C=C\C(O)=O)cc1
InChI Key InChIKey=WIYPHWOCUFWQTJ-ZWPAVUJESA-N
Data  2 IC50
PDB links: 1 PDB ID matches this monomer.
  Tab Delimited (TSV)   2D SDfile   Computed 3D by Vconf -m prep SDfile
Find this compound or compounds like it in BindingDB:
Activity Spreadsheet -- Enzyme Inhibition Constant Data from BindingDB
Found 2 hits for monomerid = 50153705
TargetEstrogen receptor(Homo sapiens (Human))
Astrazeneca
Curated by ChEMBL
LigandPNGBDBM50153705(CHEMBL3774494)
Affinity DataIC50:  44nM. Assay description: Displacement of fluormone ES2 from GST-tagged recombinant human ERalpha LBD after 1 hr by Lanthascreen TR-FRET assay
TargetEstrogen receptor(Homo sapiens (Human))
Astrazeneca
Curated by ChEMBL
LigandPNGBDBM50153705(CHEMBL3774494)
Affinity DataIC50:  11nM. Assay description: Downregulation of ERalpha in human MCF7 cells incubated for 18 to 22 hrs by immunofluorescence assay