BDBM50153859 CHEMBL184659::N-(3-{[7-METHOXY-6-(2-PYRROLIDIN-1-YLETHOXY)QUINAZOLIN-4-YL]AMINO}-4-METHYLPHENYL)-2-MORPHOLIN-4-YLISONICOTINAMIDE::N-{3-[7-Methoxy-6-(2-pyrrolidin-1-yl-ethoxy)-quinazolin-4-ylamino]-4-methyl-phenyl}-2-morpholin-4-yl-isonicotinamide
SMILES COc1cc2ncnc(Nc3cc(NC(=O)c4ccnc(c4)N4CCOCC4)ccc3C)c2cc1OCCN1CCCC1
InChI Key InChIKey=LGTPGGBSDIEHKM-UHFFFAOYSA-N
Data  2 IC50
PDB links: 2 PDB IDs match this monomer.
  Tab Delimited (TSV)   2D SDfile   Computed 3D by Vconf -m prep SDfile
Find this compound or compounds like it in BindingDB:
Activity Spreadsheet -- Enzyme Inhibition Constant Data from BindingDB
Found 2 hits for monomerid = 50153859
TargetMitogen-activated protein kinase 14(Homo sapiens (Human))
Novartis Research Foundation
Curated by ChEMBL
LigandPNGBDBM50153859(CHEMBL184659 | N-(3-{[7-METHOXY-6-(2-PYRROLIDIN-1-...)
Affinity DataIC50:  39nM. Assay description: Inhibition of p38alpha kinase
TargetMitogen-activated protein kinase 14(Homo sapiens (Human))
Novartis Research Foundation
Curated by ChEMBL
LigandPNGBDBM50153859(CHEMBL184659 | N-(3-{[7-METHOXY-6-(2-PYRROLIDIN-1-...)
Affinity DataIC50:  30nM. Assay description: Inhibitory concentration against alpha mitogen activated protein kinase p38 activity