BDBM50153878 CHEMBL186580::N-[5-(6,7-Dimethoxy-quinazolin-4-ylamino)-2,4-difluoro-phenyl]-benzamide
SMILES COc1cc2ncnc(Nc3cc(NC(=O)c4ccccc4)c(F)cc3F)c2cc1OC
InChI Key InChIKey=RDRNBLXUDTUCRQ-UHFFFAOYSA-N
Data  2 IC50
  Tab Delimited (TSV)   2D SDfile   Computed 3D by Vconf -m prep SDfile
Find this compound or compounds like it in BindingDB:
Activity Spreadsheet -- Enzyme Inhibition Constant Data from BindingDB
Found 2 hits for monomerid = 50153878
TargetMitogen-activated protein kinase 14(Homo sapiens (Human))
Astrazeneca
Curated by ChEMBL
LigandPNGBDBM50153878(CHEMBL186580 | N-[5-(6,7-Dimethoxy-quinazolin-4-yl...)
Affinity DataIC50:  50nM. Assay description: Inhibitory concentration against alpha mitogen activated protein kinase p38 activity
In DepthDetails ArticlePubMed
TargetEpidermal growth factor receptor(Homo sapiens (Human))
Astrazeneca
Curated by ChEMBL
LigandPNGBDBM50153878(CHEMBL186580 | N-[5-(6,7-Dimethoxy-quinazolin-4-yl...)
Affinity DataIC50:  490nM. Assay description: Inhibitory concentration against Epidermal growth factor receptor tyrosine kinase activity
In DepthDetails ArticlePubMed