BDBM50154161 CHEMBL360630::[1-(2-Methyl-2H-pyrazol-3-ylaminooxalyl)-pentyl]-carbamic acid 2,2-dimethyl-butyl ester
SMILES CCCC[C@H](NC(=O)OCC(C)(C)CC)C(=O)C(=O)Nc1ccnn1C
InChI Key InChIKey=PCYJVFFBAYHRIP-ZDUSSCGKSA-N
Data  1 IC50
  Tab Delimited (TSV)   2D SDfile   Computed 3D by Vconf -m prep SDfile
Find this compound or compounds like it in BindingDB:
Activity Spreadsheet -- Enzyme Inhibition Constant Data from BindingDB
Found 1 hit for monomerid = 50154161
TargetCathepsin K(Homo sapiens (Human))
Glaxosmithkline
Curated by ChEMBL
LigandPNGBDBM50154161(CHEMBL360630 | [1-(2-Methyl-2H-pyrazol-3-ylaminoox...)
Affinity DataIC50:  1.20E+3nM. Assay description: Inhibitory potency against human Cathepsin K
In DepthDetails ArticlePubMed