BDBM50154500 3-(4-Bromo-benzyl)-1-(3,5-dichloro-phenyl)-6-iodo-3-methyl-1H-imidazo[1,2-a]imidazol-2-one::CHEMBL187348
SMILES CC1(Cc2ccc(Br)cc2)C(=O)N(c2nc(I)cn12)c1cc(Cl)cc(Cl)c1
InChI Key InChIKey=KLBIIKRAGBFNBO-UHFFFAOYSA-N
Data  1 Kd
  Tab Delimited (TSV)   2D SDfile   Computed 3D by Vconf -m prep SDfile
Find this compound or compounds like it in BindingDB:
Activity Spreadsheet -- Enzyme Inhibition Constant Data from BindingDB
Found 1 hit for monomerid = 50154500
TargetIntegrin alpha-L/beta-2(Homo sapiens (Human))
Boehringer Ingelheim Pharmaceuticals
Curated by ChEMBL
LigandPNGBDBM50154500(3-(4-Bromo-benzyl)-1-(3,5-dichloro-phenyl)-6-iodo-...)
Affinity DataKd: >2.00E+4nM. Assay description: Dissociation constant for human Lymphocyte function associated antigen 1 in LFA-1/ICAM-1 binding assay
In DepthDetails ArticlePubMed