BDBM50154754 7-Hydroxymethyl-3,4-dihydro-2H-[1,4]diazepino[6,7,1-hi]indol-1-one::CHEMBL187344
SMILES OCc1cn2CCNC(=O)c3cccc1c23
InChI Key InChIKey=NALXYZRHYSSWTE-UHFFFAOYSA-N
Data  2 KI
  Tab Delimited (TSV)   2D SDfile   Computed 3D by Vconf -m prep SDfile
Find this compound or compounds like it in BindingDB:
Activity Spreadsheet -- Enzyme Inhibition Constant Data from BindingDB
Found 2 hits for monomerid = 50154754
TargetPoly [ADP-ribose] polymerase 1(Homo sapiens (Human))
Bristol-Myers Squibb Pharmaceutical Research And Development
Curated by ChEMBL
LigandPNGBDBM50154754(7-Hydroxymethyl-3,4-dihydro-2H-[1,4]diazepino[6,7,...)
Affinity DataKi:  79nM. Assay description: Inhibition of human PARP-1
In DepthDetails ArticlePubMed
TargetPoly [ADP-ribose] polymerase 1(Homo sapiens (Human))
Bristol-Myers Squibb Pharmaceutical Research And Development
Curated by ChEMBL
LigandPNGBDBM50154754(7-Hydroxymethyl-3,4-dihydro-2H-[1,4]diazepino[6,7,...)
Affinity DataKi:  79nM. Assay description: Inhibition of human Poly (ADP-ribose) polymerase 1 enzyme
In DepthDetails ArticlePubMed