BDBM50154914 CHEMBL3775641
SMILES [H][C@@]12[C@@H](Cl)[C@]3(OC1(C)C)[C@@](C)(Cl)CC[C@H](OC(C)=O)[C@@]3(C)[C@@H](OC(=O)c1ccccc1)[C@H]2OC(=O)\C=C\c1ccccc1
InChI Key InChIKey=RJMQFJLCVAAIFH-ZGIPRAPUSA-N
Data  1 KI
  Tab Delimited (TSV)   2D SDfile   Computed 3D by Vconf -m prep SDfile
Find this compound or compounds like it in BindingDB:
Activity Spreadsheet -- Enzyme Inhibition Constant Data from BindingDB
Found 1 hit for monomerid = 50154914
TargetATP-dependent translocase ABCB1(Homo sapiens (Human))
Instituto Universitario De Bio-Org£Nica&Quot;Antonio Gonz£Lez&Quot
Curated by ChEMBL
LigandPNGBDBM50154914(CHEMBL3775641)
Affinity DataKi:  1.34E+3nM. Assay description: Inhibition of human MDR1 expressed in mouse NIH/3T3 cells assessed as inhibition of daunomycin efflux incubated for 30 mins by flow cytometry
In DepthDetails ArticlePubMed