BDBM50155305 CHEMBL3782021
SMILES CC(C)CC[C@]1(Cc2ccccc2)NC=C(C1=O)[C@@]1(Cc2ccccc2)NC=C(C1=O)[C@]1(CCCN)NC=C(C1=O)[C@@]1(CC(C)C)NC=C(Cc2ccccc2)C1=O
InChI Key InChIKey=OJAXFIGABSTFEW-XDFNOTDQSA-N
Data  1 KI
  Tab Delimited (TSV)   2D SDfile   Computed 3D by Vconf -m prep SDfile
Find this compound or compounds like it in BindingDB:
Activity Spreadsheet -- Enzyme Inhibition Constant Data from BindingDB
Found 1 hit for monomerid = 50155305
TargetSomatostatin receptor type 4(Homo sapiens (Human))
University Of Gothenburg
Curated by ChEMBL
LigandPNGBDBM50155305(CHEMBL3782021)
Affinity DataKi:  2.05E+3nM. Assay description: Displacement of [125I]-SRIF14 from human sst4 receptor
In DepthDetails ArticlePubMed