BDBM50155307 CHEMBL3781796
SMILES [H]C1(NC(=O)C(Cc2ccccc2)NC(=O)C([H])(NC(=O)C(CCCCN)NC(=O)C([H])(NC(=O)C(Cc2ccccc2)NC(=O)C(Cc2ccccc2)NC(=O)C(CC(N)=O)NC(=O)C(CCCCN)NC(=O)C(CSSCC(NC(=O)C(CO)NC1=O)C(O)=O)NC(=O)CNC(=O)C(C)NC(=O)C(CCCCN)NC(=O)C(CCCNC(N)=N)NC(=O)C(CCC(O)=O)NC(=O)C(CCCNC(N)=N)NC(=O)C1CCCN1C(=O)C(C)NC(=O)C(CCSC)NC(=O)C(C)NC(=O)C1CCCN1C(=O)C(CC(N)=O)NC(=O)C(CO)NC(=O)C(CC(N)=O)NC(=O)C(C)NC(=O)C(N)CO)C(C)O)C(C)O)C(C)O
InChI Key InChIKey=UFTWURNESKASNU-NYGSAMMVSA-N
Data  2 KI
  Tab Delimited (TSV)   2D SDfile   Computed 3D by Vconf -m prep SDfile
Find this compound or compounds like it in BindingDB:
Activity Spreadsheet -- Enzyme Inhibition Constant Data from BindingDB
Found 2 hits for monomerid = 50155307
TargetSomatostatin receptor type 2(Homo sapiens (Human))
University Of Gothenburg
Curated by ChEMBL
LigandPNGBDBM50155307(CHEMBL3781796)
Affinity DataKi:  0.0300nM. Assay description: Displacement of [125I]tyr11-SRIF from human sst2 receptor after 60 mins by liquid scintillation counting method
In DepthDetails ArticlePubMed
TargetSomatostatin receptor type 4(Homo sapiens (Human))
University Of Gothenburg
Curated by ChEMBL
LigandPNGBDBM50155307(CHEMBL3781796)
Affinity DataKi:  1.30nM. Assay description: Displacement of [125I]tyr11-SRIF from human sst4 receptor after 60 mins by liquid scintillation counting method
In DepthDetails ArticlePubMed