BDBM50155606 3-Butyl-1,2,3,4,5,6-hexahydro-benzo[f]isoquinoline::CHEMBL188713::CHEMBL541299
SMILES CCCCN1CCC2=C(CCc3ccccc23)C1
InChI Key InChIKey=VXQVYBORCSUFDN-UHFFFAOYSA-N
Data  1 KI  2 IC50
  Tab Delimited (TSV)   2D SDfile   Computed 3D by Vconf -m prep SDfile
Find this compound or compounds like it in BindingDB:
Activity Spreadsheet -- Enzyme Inhibition Constant Data from BindingDB
Found 3 hits for monomerid = 50155606
TargetD(3) dopamine receptor(Rattus norvegicus (Rat))
University Of Michigan
Curated by ChEMBL
LigandPNGBDBM50155606(3-Butyl-1,2,3,4,5,6-hexahydro-benzo[f]isoquinoline...)
Affinity DataKi:  25nM. Assay description: Binding affinity towards dopamine D3 receptor in ventral striatal membranes of sprague-dawley rat brain by using [3H]-PD 128907 as radioligand
In DepthDetails ArticlePubMed
TargetD(2) dopamine receptor(Rattus norvegicus (rat))
Merck Sharp And Dohme Research Laboratories
Curated by ChEMBL
LigandPNGBDBM50155606(3-Butyl-1,2,3,4,5,6-hexahydro-benzo[f]isoquinoline...)
Affinity DataIC50:  63nM. Assay description: Inhibition of [3H](-)-sulpiride binding to rat striatum dopamine receptor D2
In DepthDetails ArticlePubMed
TargetSigma non-opioid intracellular receptor 1(Homo sapiens (Human))
Merck Sharp And Dohme Research Laboratories
Curated by ChEMBL
LigandPNGBDBM50155606(3-Butyl-1,2,3,4,5,6-hexahydro-benzo[f]isoquinoline...)
Affinity DataIC50:  7.60nM. Assay description: In vitro for the binding affinity against sigma receptor by using [3H]DTG as radioligand in guinea pig cerebellum
In DepthDetails ArticlePubMed