BDBM50155936 CHEMBL3781471
SMILES CCN1C(=O)c2cccc3c(ccc1c23)S(=O)(=O)NC1CCCCC1
InChI Key InChIKey=JFSBLFHOLQSPDO-UHFFFAOYSA-N
Data  1 IC50  1 Kd
PDB links: 1 PDB ID matches this monomer.
  Tab Delimited (TSV)   2D SDfile   Computed 3D by Vconf -m prep SDfile
Find this compound or compounds like it in BindingDB:
Activity Spreadsheet -- Enzyme Inhibition Constant Data from BindingDB
Found 2 hits for monomerid = 50155936
TargetBromodomain-containing protein 4(Homo sapiens (Human))
Guangzhou Institutes Of Biomedicine And Health
Curated by ChEMBL
LigandPNGBDBM50155936(CHEMBL3781471)
Affinity DataKd:  124nM. Assay description: Binding affinity to human His6-tagged BRD4 bromodomain 1 (N44 to E168 residues) expressed in Escherichia coli BL21(DE3) cells by isothermal titration...
TargetBromodomain-containing protein 4(Homo sapiens (Human))
Guangzhou Institutes Of Biomedicine And Health
Curated by ChEMBL
LigandPNGBDBM50155936(CHEMBL3781471)
Affinity DataIC50:  130nM. Assay description: Inhibition of human His6-tagged BRD4 bromodomain 1 (N44 to E168 residues) expressed in Escherichia coli BL21(DE3) cells using biotin-H4KAc4 as substr...