BDBM50155995 CHEMBL362324::{(R)-1-[(S)-4-((S)-1-Benzylcarbamoyl-2-methyl-propylcarbamoyl)-2-hydroxy-1-isobutyl-pentylcarbamoyl]-2-methanesulfonyl-ethyl}-carbamic acid tert-butyl ester
SMILES CC(C)C[C@H](NC(=O)[C@H](CS(C)(=O)=O)NC(=O)OC(C)(C)C)C(O)CC(C)C(=O)N[C@@H](C(C)C)C(=O)NCc1ccccc1
InChI Key InChIKey=XLXYOWSUVOIWNA-SMYSXFNISA-N
Data  1 KI
  Tab Delimited (TSV)   2D SDfile   Computed 3D by Vconf -m prep SDfile
Find this compound or compounds like it in BindingDB:
Activity Spreadsheet -- Enzyme Inhibition Constant Data from BindingDB
Found 1 hit for monomerid = 50155995
TargetBeta-secretase 1(Homo sapiens (Human))
University Of ZüRich
Curated by ChEMBL
LigandPNGBDBM50155995(CHEMBL362324 | {(R)-1-[(S)-4-((S)-1-Benzylcarbamoy...)
Affinity DataKi:  1.13E+3nM. Assay description: Binding affinity towards Beta-secretase determined using continuum electrostatics solvation
In DepthDetails ArticlePubMed