BDBM50156303 2-(3-benzenesulfonylfuroxan-4-yloxymethyl)-2,5,7,8-tetramethylchroman-6-ol::2-(4-Benzenesulfonyl-5-oxy-furazan-3-yloxymethyl)-2,5,7,8-tetramethyl-chroman-6-ol::CHEMBL360593
SMILES Cc1c(C)c2OC(C)(COc3no[n+]([O-])c3S(=O)(=O)c3ccccc3)CCc2c(C)c1O
InChI Key InChIKey=KEMUZIQRFFNLAM-UHFFFAOYSA-N
Data  2 EC50
  Tab Delimited (TSV)   2D SDfile   Computed 3D by Vconf -m prep SDfile
Find this compound or compounds like it in BindingDB:
Activity Spreadsheet -- Enzyme Inhibition Constant Data from BindingDB
Found 2 hits for monomerid = 50156303
TargetAlpha-1D adrenergic receptor(Rattus norvegicus (Rat))
Università
Curated by ChEMBL
LigandPNGBDBM50156303(2-(3-benzenesulfonylfuroxan-4-yloxymethyl)-2,5,7,8...)
Affinity DataEC50:  44nM. Assay description: Vasodilator activity assessed as ability to relax phenylephrine-induced contraction of Wistar rat aortic strips
In DepthDetails ArticlePubMed
TargetAlpha-1D adrenergic receptor(Rattus norvegicus (Rat))
Università
Curated by ChEMBL
LigandPNGBDBM50156303(2-(3-benzenesulfonylfuroxan-4-yloxymethyl)-2,5,7,8...)
Affinity DataEC50:  670nM. Assay description: Vasodilator activity assessed as ability to relax phenylephrine-induced contraction of Wistar rat aortic strips in presence of 1 uM ODQ
In DepthDetails ArticlePubMed