BDBM50156595 (7RS,9aRS)-2-furan-2-yl-N5-(2-pyrimidin-2-yloctahydropyrido[1,2-a]pyrazin-7-ylmethyl)[1,2,4]triazolo[1,5-a]-[1,3,5]triazine-5,7-diamine::CHEMBL222868
SMILES Nc1nc(NC[C@@H]2CC[C@@H]3CN(CCN3C2)c2ncccn2)nc2nc(nn12)-c1ccco1
InChI Key InChIKey=BBVRFFOGAIOFTE-LSDHHAIUSA-N
Data  2 KI
  Tab Delimited (TSV)   2D SDfile   Computed 3D by Vconf -m prep SDfile
Find this compound or compounds like it in BindingDB:
Activity Spreadsheet -- Enzyme Inhibition Constant Data from BindingDB
Found 2 hits for monomerid = 50156595
TargetAdenosine receptor A2a(Rattus norvegicus (rat))
Biogen Idec
Curated by ChEMBL
LigandPNGBDBM50156595((7RS,9aRS)-2-furan-2-yl-N5-(2-pyrimidin-2-yloctahy...)
Affinity DataKi:  0.300nM. Assay description: Displacement of [3H]ZM241385 from adenosine A2A receptor in rat brain membrane
In DepthDetails ArticlePubMed
TargetAdenosine receptor A1(Rattus norvegicus (rat))
Biogen Idec
Curated by ChEMBL
LigandPNGBDBM50156595((7RS,9aRS)-2-furan-2-yl-N5-(2-pyrimidin-2-yloctahy...)
Affinity DataKi:  1.60E+3nM. Assay description: Displacement of [3h]DPCPX from adenosine A receptor in rat cerebral cortex membrane
In DepthDetails ArticlePubMed