BDBM50157903 CHEMBL3781988
SMILES CN1CCN(CC1)c1ccc(NC(=O)c2c(Nc3ccccn3)cc[nH]c2=O)cc1
InChI Key InChIKey=LDIRICACJZEUNH-UHFFFAOYSA-N
Data  2 KI
  Tab Delimited (TSV)   2D SDfile   Computed 3D by Vconf -m prep SDfile
Find this compound or compounds like it in BindingDB:
Activity Spreadsheet -- Enzyme Inhibition Constant Data from BindingDB
Found 2 hits for monomerid = 50157903
TargetEpidermal growth factor receptor(Homo sapiens (Human))
Genentech
Curated by ChEMBL
LigandPNGBDBM50157903(CHEMBL3781988)
Affinity DataKi:  108nM. Assay description: Inhibition of human EGFR catalytic domain (668 to 1210 residues) T790M/L858R double mutant using Fl-EEPLYWSFPAKKK-CONH2 peptide substrate preincubate...
In DepthDetails ArticlePubMed
TargetEpidermal growth factor receptor(Homo sapiens (Human))
Genentech
Curated by ChEMBL
LigandPNGBDBM50157903(CHEMBL3781988)
Affinity DataKi: >2.54E+3nM. Assay description: Inhibition of human N-terminal GST-tagged EGFR catalytic domain (669 to 1210 residues) expressed in baculovirus expression system using Fl-EEPLYWSFPA...
In DepthDetails ArticlePubMed