BDBM50157939 CHEMBL3780006
SMILES Clc1cccc(CCNc2cc[nH]c(=O)c2C(=O)Nc2ccccc2)c1
InChI Key InChIKey=HWWXIZUVQNCATG-UHFFFAOYSA-N
Data  2 KI
  Tab Delimited (TSV)   2D SDfile   Computed 3D by Vconf -m prep SDfile
Find this compound or compounds like it in BindingDB:
Activity Spreadsheet -- Enzyme Inhibition Constant Data from BindingDB
Found 2 hits for monomerid = 50157939
TargetEpidermal growth factor receptor(Homo sapiens (Human))
Genentech
Curated by ChEMBL
LigandPNGBDBM50157939(CHEMBL3780006)
Affinity DataKi:  330nM. Assay description: Inhibition of human EGFR catalytic domain (668 to 1210 residues) T790M/L858R double mutant using Fl-EEPLYWSFPAKKK-CONH2 peptide substrate preincubate...
In DepthDetails ArticlePubMed
TargetEpidermal growth factor receptor(Homo sapiens (Human))
Genentech
Curated by ChEMBL
LigandPNGBDBM50157939(CHEMBL3780006)
Affinity DataKi:  1.21E+3nM. Assay description: Inhibition of human N-terminal GST-tagged EGFR catalytic domain (669 to 1210 residues) expressed in baculovirus expression system using Fl-EEPLYWSFPA...
In DepthDetails ArticlePubMed