BDBM50158065 (2S,6R)-4-Naphthalen-2-yl-4-aza-tricyclo[5.2.1.0*2,6*]dec-8-ene-3,5-dione::CHEMBL181674
SMILES Oc1c2C3CC(C=C3)c2c(O)n1-c1ccc2ccccc2c1
InChI Key InChIKey=FHWJJPSAQQZCSI-UHFFFAOYSA-N
Data  2 KI  3 IC50
  Tab Delimited (TSV)   2D SDfile   Computed 3D by Vconf -m prep SDfile
Find this compound or compounds like it in BindingDB:
Activity Spreadsheet -- Enzyme Inhibition Constant Data from BindingDB
Found 5 hits for monomerid = 50158065
TargetAndrogen receptor(Homo sapiens (Human))
Bristol-Myers Squibb Pharmaceutical Research Institute
Curated by ChEMBL
LigandPNGBDBM50158065((2S,6R)-4-Naphthalen-2-yl-4-aza-tricyclo[5.2.1.0*2...)
Affinity DataKi:  11nM. Assay description: Inhibition of [3H]-DHT binding to T877A androgen receptor of LNCaP cells
In DepthDetails ArticlePubMed
TargetAndrogen receptor(Homo sapiens (Human))
Bristol-Myers Squibb Pharmaceutical Research Institute
Curated by ChEMBL
LigandPNGBDBM50158065((2S,6R)-4-Naphthalen-2-yl-4-aza-tricyclo[5.2.1.0*2...)
Affinity DataKi:  284nM. Assay description: Inhibition of [3H]-DHT binding to androgen receptor of MDA-453 cells
In DepthDetails ArticlePubMed
TargetAndrogen receptor(Homo sapiens (Human))
Bristol-Myers Squibb Pharmaceutical Research Institute
Curated by ChEMBL
LigandPNGBDBM50158065((2S,6R)-4-Naphthalen-2-yl-4-aza-tricyclo[5.2.1.0*2...)
Affinity DataIC50:  265nM. Assay description: Inhibition of L701H/T877A mutant androgen receptor of human prostate cancer MDAMB-PCa2b cell proliferation
In DepthDetails ArticlePubMed
TargetAndrogen receptor(Homo sapiens (Human))
Bristol-Myers Squibb Pharmaceutical Research Institute
Curated by ChEMBL
LigandPNGBDBM50158065((2S,6R)-4-Naphthalen-2-yl-4-aza-tricyclo[5.2.1.0*2...)
Affinity DataIC50:  1.21E+3nM. Assay description: Inhibition of human androgen receptor of breast carcinoma MDA-453 cells in reporter gene assay
In DepthDetails ArticlePubMed
TargetAndrogen receptor(Homo sapiens (Human))
Bristol-Myers Squibb Pharmaceutical Research Institute
Curated by ChEMBL
LigandPNGBDBM50158065((2S,6R)-4-Naphthalen-2-yl-4-aza-tricyclo[5.2.1.0*2...)
Affinity DataIC50:  84nM. Assay description: Inhibition of T877A androgen receptor of human prostate cancer cells in reporter gene assay
In DepthDetails ArticlePubMed