BDBM501583 US11026958, Example 2
SMILES NS(=O)(=O)c1ccc(cc1)C1CC1c1ccnc(n1)N1CCOCC1
InChI Key InChIKey=QENPSWYLWIBIOM-UHFFFAOYSA-N
Data  1 EC50
  Tab Delimited (TSV)   2D SDfile   Computed 3D by Vconf -m prep SDfile
Find this compound or compounds like it in BindingDB:
Activity Spreadsheet -- Enzyme Inhibition Constant Data from BindingDB
Found 1 hit for monomerid = 501583
TargetNeuronal acetylcholine receptor subunit alpha-7(Homo sapiens (Human))
Merck Sharp & Dohme
US Patent
LigandPNGBDBM501583(US11026958, Example 2)
Affinity DataEC50:  2.00E+3nM. Assay description: Test compounds were serially diluted in DMSO and then resuspended to the final test concentration in external recording solution, with, or without 40...
Ligand InfoPC cidPC sid
In DepthDetails US Patent