BDBM50158893 CHEMBL3786990
SMILES Cn1nccc1-c1cc(ccc1C1CCOc2cc(ccc12)S(=O)(=O)Nc1nccs1)C(F)(F)F
InChI Key InChIKey=MIIOBHGQUATGFU-UHFFFAOYSA-N
Data  1 IC50
  Tab Delimited (TSV)   2D SDfile   Computed 3D by Vconf -m prep SDfile
Find this compound or compounds like it in BindingDB:
Activity Spreadsheet -- Enzyme Inhibition Constant Data from BindingDB
Found 1 hit for monomerid = 50158893
TargetSodium channel protein type 9 subunit alpha(Homo sapiens (Human))
Temple University
Curated by ChEMBL
LigandPNGBDBM50158893(CHEMBL3786990)
Affinity DataIC50:  4nM. Assay description: Inhibition of Nav1.7 (unknown origin) overexpressed in HEK293 cells preincubated for 15 to 20 mins followed by depolarization with 10 to 30 uM veratr...
In DepthDetails ArticlePubMed