BDBM50159246 1,2,3,6,7-Pentachloro-naphthalene::1,2,3,6,7-pentachloronaphthalene::CHEMBL195537
SMILES Clc1cc2cc(Cl)c(Cl)c(Cl)c2cc1Cl
InChI Key InChIKey=MKCASBPTHPJCDC-UHFFFAOYSA-N
Data  3 IC50
  Tab Delimited (TSV)   2D SDfile   Computed 3D by Vconf -m prep SDfile
Find this compound or compounds like it in BindingDB:
Activity Spreadsheet -- Enzyme Inhibition Constant Data from BindingDB
Found 3 hits for monomerid = 50159246
TargetCytochrome P450 2A6(Homo sapiens (Human))
University Of Kuopio
Curated by ChEMBL
LigandPNGBDBM50159246(1,2,3,6,7-Pentachloro-naphthalene | 1,2,3,6,7-pent...)
Affinity DataIC50: >6.00E+5nM. Assay description: Inhibitory concentration against human cytochrome P450 2A6
In DepthDetails ArticlePubMed
TargetCytochrome P450 2A5(Mus musculus)
Jadavpur University
Curated by ChEMBL
LigandPNGBDBM50159246(1,2,3,6,7-Pentachloro-naphthalene | 1,2,3,6,7-pent...)
Affinity DataIC50:  3.00E+5nM. Assay description: Inhibition of mouse CYP2A5
In DepthDetails ArticlePubMed
TargetCytochrome P450 2A5(Mus musculus)
Jadavpur University
Curated by ChEMBL
LigandPNGBDBM50159246(1,2,3,6,7-Pentachloro-naphthalene | 1,2,3,6,7-pent...)
Affinity DataIC50:  3.00E+5nM. Assay description: Inhibitory concentration against mouse cytochrome P450 2A5
In DepthDetails ArticlePubMed