BDBM50159496 CHEMBL3785381
SMILES CC(C)OC(=O)C1=C(C)Nc2nccn2C1c1ccco1
InChI Key InChIKey=XSFNZYDKVKNNMU-UHFFFAOYSA-N
Data  1 KI
  Tab Delimited (TSV)   2D SDfile   Computed 3D by Vconf -m prep SDfile
Find this compound or compounds like it in BindingDB:
Activity Spreadsheet -- Enzyme Inhibition Constant Data from BindingDB
Found 1 hit for monomerid = 50159496
TargetAdenosine receptor A2b(Homo sapiens (Human))
Uppsala University
Curated by ChEMBL
LigandPNGBDBM50159496(CHEMBL3785381)
Affinity DataKi:  86nM. Assay description: Displacement of [3H]DPCPX from human Adenosine A2B receptor expressed in HEK293 cells after 30 mins
In DepthDetails ArticlePubMed