BDBM501601 US11026958, Example B1
SMILES CC(C)c1ccc(cn1)C1C(C1[Si](C)(C)C)c1ccc(cc1)S(N)(=O)=O
InChI Key InChIKey=OXNVLHNWSWWPAB-UHFFFAOYSA-N
Data  1 EC50
  Tab Delimited (TSV)   2D SDfile   Computed 3D by Vconf -m prep SDfile
Find this compound or compounds like it in BindingDB:
Activity Spreadsheet -- Enzyme Inhibition Constant Data from BindingDB
Found 1 hit for monomerid = 501601
TargetNeuronal acetylcholine receptor subunit alpha-7(Homo sapiens (Human))
Merck Sharp & Dohme
US Patent
LigandPNGBDBM501601(US11026958, Example B1)
Affinity DataEC50:  1.60E+3nM. Assay description: Test compounds were serially diluted in DMSO and then resuspended to the final test concentration in external recording solution, with, or without 40...
Ligand InfoPC cidPC sid
In DepthDetails US Patent