BDBM50160338 4-[2-(3,4-Dichloro-benzylamino)-6-oxo-1,6-dihydro-purin-7-yl]-butyric acid ethyl ester::CHEMBL181045
SMILES CCOC(=O)CCCn1cnc2nc(NCc3ccc(Cl)c(Cl)c3)[nH]c(=O)c12
InChI Key InChIKey=RADAFPBWNKQHEY-UHFFFAOYSA-N
Data  3 KI
  Tab Delimited (TSV)   2D SDfile   Computed 3D by Vconf -m prep SDfile
Find this compound or compounds like it in BindingDB:
Activity Spreadsheet -- Enzyme Inhibition Constant Data from BindingDB
Found 3 hits for monomerid = 50160338
TargetDNA polymerase III subunit alpha(Bacillus subtilis)
Glsynthesis
Curated by ChEMBL
LigandPNGBDBM50160338(4-[2-(3,4-Dichloro-benzylamino)-6-oxo-1,6-dihydro-...)
Affinity DataKi:  47nM. Assay description: Inhibitory constant against DNA polymerases IIIE from Bacillus subtilis; (a)
In DepthDetails ArticlePubMed
TargetDNA polymerase III PolC-type(Bacillus subtilis)
Glsynthesis
Curated by ChEMBL
LigandPNGBDBM50160338(4-[2-(3,4-Dichloro-benzylamino)-6-oxo-1,6-dihydro-...)
Affinity DataKi:  150nM. Assay description: Inhibitory constant against DNA polymerases IIIC produced by Bacillus subtilis; (a)
In DepthDetails ArticlePubMed
TargetDNA polymerase III subunit alpha(Escherichia coli)
Glsynthesis
Curated by ChEMBL
LigandPNGBDBM50160338(4-[2-(3,4-Dichloro-benzylamino)-6-oxo-1,6-dihydro-...)
Affinity DataKi:  1.69E+4nM. Assay description: Inhibitory constant against DNA polymerases IIIE from Escherichia coli; (a)
In DepthDetails ArticlePubMed