BDBM50160349 6-(4-Chloro-3-chloromethyl-benzylamino)-1H-pyrimidine-2,4-dione::CHEMBL435556
SMILES ClCc1cc(CNc2cc(=O)[nH]c(=O)[nH]2)ccc1Cl
InChI Key InChIKey=WPGHQEGYMBWQQA-UHFFFAOYSA-N
Data  3 KI
  Tab Delimited (TSV)   2D SDfile   Computed 3D by Vconf -m prep SDfile
Find this compound or compounds like it in BindingDB:
Activity Spreadsheet -- Enzyme Inhibition Constant Data from BindingDB
Found 3 hits for monomerid = 50160349
TargetDNA polymerase III PolC-type(Bacillus subtilis)
Glsynthesis
Curated by ChEMBL
LigandPNGBDBM50160349(6-(4-Chloro-3-chloromethyl-benzylamino)-1H-pyrimid...)
Affinity DataKi:  420nM. Assay description: Inhibitory constant against DNA polymerases IIIC produced by Bacillus subtilis; (a)
In DepthDetails ArticlePubMed
TargetDNA polymerase III subunit alpha(Bacillus subtilis)
Glsynthesis
Curated by ChEMBL
LigandPNGBDBM50160349(6-(4-Chloro-3-chloromethyl-benzylamino)-1H-pyrimid...)
Affinity DataKi:  1.50E+3nM. Assay description: Inhibitory constant against DNA polymerases IIIE from Bacillus subtilis; (a)
In DepthDetails ArticlePubMed
TargetDNA polymerase III subunit alpha(Escherichia coli)
Glsynthesis
Curated by ChEMBL
LigandPNGBDBM50160349(6-(4-Chloro-3-chloromethyl-benzylamino)-1H-pyrimid...)
Affinity DataKi: >2.80E+5nM. Assay description: Inhibitory constant against DNA polymerases IIIE from Escherichia coli; (a)
In DepthDetails ArticlePubMed