BDBM50160613 5-Fluoro-3-[trans-4-[4-(1H-indol-4-yl)-1-piperazinyl]-cyclohexyl]-1H-indole::5-Fluoro-3-{4-[4-(1H-indol-4-yl)-piperazin-1-yl]-cyclohexyl}-1H-indole::CHEMBL178267
SMILES Fc1ccc2[nH]cc([C@H]3CC[C@@H](CC3)N3CCN(CC3)c3cccc4[nH]ccc34)c2c1
InChI Key InChIKey=DOLPIUHNWIPHSB-KESTWPANSA-N
Data  4 KI
  Tab Delimited (TSV)   2D SDfile   Computed 3D by Vconf -m prep SDfile
Find this compound or compounds like it in BindingDB:
Activity Spreadsheet -- Enzyme Inhibition Constant Data from BindingDB
Found 4 hits for monomerid = 50160613
Target5-hydroxytryptamine receptor 1A(Homo sapiens (Human))
Wyeth Research
Curated by ChEMBL
LigandPNGBDBM50160613(5-Fluoro-3-[trans-4-[4-(1H-indol-4-yl)-1-piperazin...)
Affinity DataKi:  4.62nM. Assay description: Binding affinity determined against human 5-hydroxytryptamine 1A receptors transfected into CHO cells.
In DepthDetails ArticlePubMed
Target5-hydroxytryptamine receptor 1A(Homo sapiens (Human))
Wyeth Research
Curated by ChEMBL
LigandPNGBDBM50160613(5-Fluoro-3-[trans-4-[4-(1H-indol-4-yl)-1-piperazin...)
Affinity DataKi:  4.62nM. Assay description: Displacement of [3H]8-OH-DPAT from human 5HT1A receptor expressed in CHO cells
In DepthDetails ArticlePubMed
TargetSodium-dependent serotonin transporter(Rattus norvegicus (rat))
Wyeth Research
Curated by ChEMBL
LigandPNGBDBM50160613(5-Fluoro-3-[trans-4-[4-(1H-indol-4-yl)-1-piperazin...)
Affinity DataKi:  48.5nM. Assay description: Displacement of [3H]paroxetine from rat cortical 5HTT reuptake site
In DepthDetails ArticlePubMed
TargetSodium-dependent serotonin transporter(Rattus norvegicus (rat))
Wyeth Research
Curated by ChEMBL
LigandPNGBDBM50160613(5-Fluoro-3-[trans-4-[4-(1H-indol-4-yl)-1-piperazin...)
Affinity DataKi:  48.5nM. Assay description: Binding affinity determined against Serotonin transporter determined bydisplacement of [3H]-paroxetine from rat cortical membranes
In DepthDetails ArticlePubMed