BDBM50161088 11-Bromo-1,2,3,4,5,6-hexahydro-1,5-methano-pyrido[1,2-a][1,5]diazocin-8-one::CHEMBL432712
SMILES Brc1ccc(=O)n2CC3CNCC(C3)c12
InChI Key InChIKey=QGUJDQNVLMZXLT-UHFFFAOYSA-N
Data  1 KI  3 EC50
  Tab Delimited (TSV)   2D SDfile   Computed 3D by Vconf -m prep SDfile
Find this compound or compounds like it in BindingDB:
Activity Spreadsheet -- Enzyme Inhibition Constant Data from BindingDB
Found 4 hits for monomerid = 50161088
TargetNeuronal acetylcholine receptor subunit alpha-4/beta-2(Rattus norvegicus (Rat))
Institut F£R Pharmazeutische Chemie Der Philipps-Universit£T Marburg
Curated by ChEMBL
LigandPNGBDBM50161088(11-Bromo-1,2,3,4,5,6-hexahydro-1,5-methano-pyrido[...)
Affinity DataKi:  0.309nM. Assay description: In vitro binding affinity towards (alpha-4)2(beta-2)3 neuronal nicotinic acetylcholine receptor in P2 membrane fractions of rat forebrain
In DepthDetails ArticlePubMed
TargetNeuronal acetylcholine receptor subunit alpha-3/beta-4(Rattus norvegicus (Rat))
National Institute Of Diabetes And Digestive And Kidney Diseases
Curated by ChEMBL
LigandPNGBDBM50161088(11-Bromo-1,2,3,4,5,6-hexahydro-1,5-methano-pyrido[...)
Affinity DataEC50:  39nM. Assay description: Effective concentration in KXalpha-3-beta-4R2 cells expressing rat nicotinic acetylcholine receptor alpha3-beta4 subunits
In DepthDetails ArticlePubMed
TargetNeuronal acetylcholine receptor subunit alpha-4/beta-2(Homo sapiens (Human))
National Institute Of Diabetes And Digestive And Kidney Diseases
Curated by ChEMBL
LigandPNGBDBM50161088(11-Bromo-1,2,3,4,5,6-hexahydro-1,5-methano-pyrido[...)
Affinity DataEC50:  1.10nM. Assay description: Change in membrane potential in K-177 cells expressing acetylcholine central neuronal receptor alpha4-beta2 subunits
In DepthDetails ArticlePubMed
TargetAcetylcholine receptor subunit alpha/beta/delta/gamma(Homo sapiens (Human))
National Institute Of Diabetes And Digestive And Kidney Diseases
Curated by ChEMBL
LigandPNGBDBM50161088(11-Bromo-1,2,3,4,5,6-hexahydro-1,5-methano-pyrido[...)
Affinity DataEC50: >100nM. Assay description: Change in membrane potential in TE-671 cells expressing acetylcholine neuromuscular receptors
In DepthDetails ArticlePubMed