BDBM50161594 2-Fluoro-4-((1R,2S,5R)-5-hydroxymethyl-1,8-dimethyl-3-oxa-bicyclo[3.3.1]non-7-en-2-yl)-phenol::CHEMBL178364
SMILES CC1=CC[C@@]2(CO)CO[C@@H](c3ccc(O)c(F)c3)[C@]1(C)C2
InChI Key InChIKey=OQSPFWYBYACCQS-GVDBMIGSSA-N
Data  2 EC50
  Tab Delimited (TSV)   2D SDfile   Computed 3D by Vconf -m prep SDfile
Find this compound or compounds like it in BindingDB:
Activity Spreadsheet -- Enzyme Inhibition Constant Data from BindingDB
Found 2 hits for monomerid = 50161594
TargetEstrogen receptor(Homo sapiens (Human))
Ligand Pharmaceuticals
Curated by ChEMBL
LigandPNGBDBM50161594(2-Fluoro-4-((1R,2S,5R)-5-hydroxymethyl-1,8-dimethy...)
Affinity DataEC50:  68nM. Assay description: In vitro agonist activity for estrogen receptor alpha expressed in COS-1 cells
In DepthDetails ArticlePubMed
TargetEstrogen receptor beta(Homo sapiens (Human))
Ligand Pharmaceuticals
Curated by ChEMBL
LigandPNGBDBM50161594(2-Fluoro-4-((1R,2S,5R)-5-hydroxymethyl-1,8-dimethy...)
Affinity DataEC50:  6nM. Assay description: In vitro agonist activity for estrogen receptor beta expressed in COS-1 cells
In DepthDetails ArticlePubMed