BDBM50162480 CHEMBL3793200
SMILES Cc1c(sc2ncn(C)c(=O)c12)C(=O)N1CCCCC1
InChI Key InChIKey=WWCSDOYMDJIHCO-UHFFFAOYSA-N
Data  1 IC50
  Tab Delimited (TSV)   2D SDfile   Computed 3D by Vconf -m prep SDfile
Find this compound or compounds like it in BindingDB:
Activity Spreadsheet -- Enzyme Inhibition Constant Data from BindingDB
Found 1 hit for monomerid = 50162480
TargetBranched-chain-amino-acid aminotransferase, mitochondrial(Homo sapiens (Human))
Glaxosmithkline
Curated by ChEMBL
LigandPNGBDBM50162480(CHEMBL3793200)
Affinity DataIC50: <6.31E+5nM. Assay description: Inhibition of human BCATm incubated for 10 mins by Amplex red- based fluorescence analysis
In DepthDetails ArticlePubMed