BDBM50162740 4-(4-But-2-ynyloxy-benzenesulfonyl)-1,1-dioxo-1lambda*6*-[1,4]thiazepane-5-carboxylic acid hydroxyamide::CHEMBL181328
SMILES CC#CCOc1ccc(cc1)S(=O)(=O)N1CCS(=O)(=O)CCC1C(=O)NO
InChI Key InChIKey=JKWHUKMFJPDCMY-UHFFFAOYSA-N
Data  3 IC50
  Tab Delimited (TSV)   2D SDfile   Computed 3D by Vconf -m prep SDfile
Find this compound or compounds like it in BindingDB:
Activity Spreadsheet -- Enzyme Inhibition Constant Data from BindingDB
Found 3 hits for monomerid = 50162740
TargetDisintegrin and metalloproteinase domain-containing protein 17(Homo sapiens (Human))
Wyeth Research
Curated by ChEMBL
LigandPNGBDBM50162740(4-(4-But-2-ynyloxy-benzenesulfonyl)-1,1-dioxo-1lam...)
Affinity DataIC50:  19nM. Assay description: Inhibitory concentration against TNF-alpha converting enzyme at 1 uM
In DepthDetails ArticlePubMed
TargetInterstitial collagenase(Homo sapiens (Human))
Wyeth Research
Curated by ChEMBL
LigandPNGBDBM50162740(4-(4-But-2-ynyloxy-benzenesulfonyl)-1,1-dioxo-1lam...)
Affinity DataIC50:  114nM. Assay description: Inhibitory concentration against matrix metalloproteinase-1 at 1 uM
In DepthDetails ArticlePubMed
TargetCollagenase 3(Homo sapiens (Human))
Wyeth Research
Curated by ChEMBL
LigandPNGBDBM50162740(4-(4-But-2-ynyloxy-benzenesulfonyl)-1,1-dioxo-1lam...)
Affinity DataIC50:  8nM. Assay description: Inhibitory concentration against Matrix metalloproteinase-13 at 1 uM
In DepthDetails ArticlePubMed