BDBM50162863 CHEMBL362665::Naphthalene-2-carboxylic acid [4-(10-methoxy-1,2,4,4a,5,6-hexahydro-pyrazino[1,2-a]quinolin-3-yl)-butyl]-amide
SMILES COc1cccc2CCC3CN(CCCCNC(=O)c4ccc5ccccc5c4)CCN3c12
InChI Key InChIKey=XLHPOAMYVQMRPZ-UHFFFAOYSA-N
Data  1 KI
  Tab Delimited (TSV)   2D SDfile   Computed 3D by Vconf -m prep SDfile
Find this compound or compounds like it in BindingDB:
Activity Spreadsheet -- Enzyme Inhibition Constant Data from BindingDB
Found 1 hit for monomerid = 50162863
TargetD(3) dopamine receptor(Rattus norvegicus (Rat))
University Of Michigan
Curated by ChEMBL
LigandPNGBDBM50162863(CHEMBL362665 | Naphthalene-2-carboxylic acid [4-(1...)
Affinity DataKi:  2.60nM. Assay description: Binding affinity D3 [3H]-PD 128907 receptor was determined using caudate-putamen of adult male Spragueo?=Dawley rats
In DepthDetails ArticlePubMed