BDBM50163757 CHEMBL428282::Des-acyl ghrelin
SMILES CC(C)C[C@H](NC(=O)[C@H](CCCCN)NC(=O)[C@H](C)NC(=O)[C@@H]1CCCN1C(=O)[C@@H]1CCCN1C(=O)[C@H](CCCCN)NC(=O)[C@H](CCCCN)NC(=O)[C@H](CO)NC(=O)[C@H](CCC(O)=O)NC(=O)[C@H](CCCCN)NC(=O)[C@H](CCCN=C(N)N)NC(=O)[C@H](CCC(N)=O)NC(=O)[C@H](CCC(N)=O)NC(=O)[C@@H](NC(=O)[C@H](CCCN=C(N)N)NC(=O)[C@H](CCC(N)=O)NC(=O)[C@H](Cc1cnc[nH]1)NC(=O)[C@H](CCC(O)=O)NC(=O)[C@@H]1CCCN1C(=O)[C@H](CO)NC(=O)[C@H](CC(C)C)NC(=O)[C@H](Cc1ccccc1)NC(=O)[C@H](CO)NC(=O)[C@H](CO)NC(=O)CN)C(C)C)C(=O)N[C@@H](CCC(N)=O)C(=O)N1CCC[C@H]1C(=O)N[C@@H](CCCN=C(N)N)C(O)=O
InChI Key InChIKey=BGHSOEHUOOAYMY-JTZMCQEISA-N
Data  2 IC50
  Tab Delimited (TSV)   2D SDfile   Computed 3D by Vconf -m prep SDfile
Find this compound or compounds like it in BindingDB:
Activity Spreadsheet -- Enzyme Inhibition Constant Data from BindingDB
Found 2 hits for monomerid = 50163757
TargetGrowth hormone secretagogue receptor type 1(Homo sapiens (Human))
University Of Western Ontario
Curated by ChEMBL
LigandPNGBDBM50163757(CHEMBL428282 | Des-acyl ghrelin)
Affinity DataIC50: >1.00E+7nM. Assay description: Displacement of [35S]MK-0677 from human growth hormone secretagogue receptor
In DepthDetails ArticlePubMed
TargetGrowth hormone secretagogue receptor type 1(Homo sapiens (Human))
University Of Western Ontario
Curated by ChEMBL
LigandPNGBDBM50163757(CHEMBL428282 | Des-acyl ghrelin)
Affinity DataIC50: >1.00E+4nM. Assay description: Binding affinity to cloned human growth hormone secretagogue receptor type 1 in a competitive binding assay with [35S]-MK-0677 as a radiolabeled liga...
In DepthDetails ArticlePubMed