BDBM50163871 CHEMBL3800106
SMILES [H][C@]12C[C@]1([C@@H](O)[C@@H](O)[C@@H]2n1cnc2c(\C=C(/O)c3ccccc3)nc(nc12)C#Cc1ccccc1)C(=O)NC
InChI Key InChIKey=XDLLKPFLFMZRNM-ONFWOEHCSA-N
Data  2 KI  1 EC50
  Tab Delimited (TSV)   2D SDfile   Computed 3D by Vconf -m prep SDfile
Find this compound or compounds like it in BindingDB:
Activity Spreadsheet -- Enzyme Inhibition Constant Data from BindingDB
Found 3 hits for monomerid = 50163871
TargetTransmembrane domain-containing protein TMIGD3(Homo sapiens (Human))
National Institute Of Diabetes And Digestive And Kidney Diseases
Curated by ChEMBL
LigandPNGBDBM50163871(CHEMBL3800106)
Affinity DataKi:  79nM. Assay description: Agonist activity at recombinant human adenosine A3 receptor expressed in CHO cells assessed as inhibition of forskolin-stimulated cAMP accumulation p...
In DepthDetails ArticlePubMed
TargetAdenosine receptor A3(Mus musculus)
National Institute Of Diabetes And Digestive And Kidney Diseases
Curated by ChEMBL
LigandPNGBDBM50163871(CHEMBL3800106)
Affinity DataKi:  136nM. Assay description: Displacement of [125I]N6-(4-amino-3-iodobenzyl)adenosine-5'-Nmethyluronamide from mouse adenosine A3 receptor expressed in HEK293 cell membranes incu...
In DepthDetails ArticlePubMed
TargetAdenosine receptor A3(Mus musculus)
National Institute Of Diabetes And Digestive And Kidney Diseases
Curated by ChEMBL
LigandPNGBDBM50163871(CHEMBL3800106)
Affinity DataEC50:  4.90nM. Assay description: Agonist activity at mouse adenosine A3 receptor expressed in HEK293 cell membranes assessed as inhibition of forskolin-stimulated cAMP accumulation p...
In DepthDetails ArticlePubMed