BDBM50164801 CHEMBL3798912
SMILES NCCCOCCOCCOCCCNC(=O)COCC(=O)N[C@@H](Cc1cnc[nH]1)C(=O)N[C@H](Cc1ccc2ccccc2c1)C(=O)N[C@@H](CCCNC(N)=N)C(=O)N[C@@H](Cc1c[nH]c2ccccc12)C(N)=O
InChI Key InChIKey=CVDQYXOEEAGKLB-HPYHLGIWSA-N
Data  3 IC50  1 EC50
  Tab Delimited (TSV)   2D SDfile   Computed 3D by Vconf -m prep SDfile
Find this compound or compounds like it in BindingDB:
Activity Spreadsheet -- Enzyme Inhibition Constant Data from BindingDB
Found 4 hits for monomerid = 50164801
TargetMelanocyte-stimulating hormone receptor(Mus musculus)
University Of Minnesota
Curated by ChEMBL
LigandPNGBDBM50164801(CHEMBL3798912)
Affinity DataIC50:  1.87E+3nM. Assay description: Displacement of 125I-NDP-MSH from mouse MC1R expressed in HEK293 cells incubated for 1 hr by gamma counting analysis
In DepthDetails ArticlePubMed
TargetMelanocyte-stimulating hormone receptor(Mus musculus)
University Of Minnesota
Curated by ChEMBL
LigandPNGBDBM50164801(CHEMBL3798912)
Affinity DataEC50:  139nM. Assay description: Agonist activity at mouse MC1R expressed in HEK293 cells assessed as cAMP accumulation incubated for 2 hrs by alphascreen assay
In DepthDetails ArticlePubMed
TargetMelanocortin receptor 4(Mus musculus)
University Of Minnesota
Curated by ChEMBL
LigandPNGBDBM50164801(CHEMBL3798912)
Affinity DataIC50:  22nM. Assay description: Displacement of 125I-NDP-MSH from mouse MC4R expressed in HEK293 cells incubated for 1 hr by gamma counting analysis
In DepthDetails ArticlePubMed
TargetMelanocortin receptor 3(Mus musculus)
University Of Minnesota
Curated by ChEMBL
LigandPNGBDBM50164801(CHEMBL3798912)
Affinity DataIC50:  999nM. Assay description: Displacement of 125I-NDP-MSH from mouse MC3R expressed in HEK293 cells incubated for 1 hr by gamma counting analysis
In DepthDetails ArticlePubMed