BDBM50166677 3-(5-Cyano-pyridin-3-yl)-3-{5-[2-(5,6,7,8-tetrahydro-[1,8]naphthyridin-2-yl)-ethoxy]-indol-1-yl}-propionic acid::CHEMBL189979
SMILES OC(=O)CC(c1cncc(c1)C#N)n1ccc2cc(OCCc3ccc4CCCNc4n3)ccc12
InChI Key InChIKey=ZVPFRHUDZYLXOW-UHFFFAOYSA-N
Data  1 IC50
  Tab Delimited (TSV)   2D SDfile   Computed 3D by Vconf -m prep SDfile
Find this compound or compounds like it in BindingDB:
Activity Spreadsheet -- Enzyme Inhibition Constant Data from BindingDB
Found 1 hit for monomerid = 50166677
TargetIntegrin alpha-V/beta-3(Homo sapiens (Human))
Johnson & Johnson Pharmaceutical Research And Development
Curated by ChEMBL
LigandPNGBDBM50166677(3-(5-Cyano-pyridin-3-yl)-3-{5-[2-(5,6,7,8-tetrahyd...)
Affinity DataIC50:  0.260nM. Assay description: Inhibitory concentration against alphaV-beta3 integrin
In DepthDetails ArticlePubMed