BDBM501672 US11028054, Example 117
SMILES Cc1nc2c(cc(cc2[nH]1)-c1ccc(cc1)-c1ccccc1CN1CC[C@@H](F)C1)C(O)=O
InChI Key
Data  1 IC50
  Tab Delimited (TSV)   2D SDfile   Computed 3D by Vconf -m prep SDfile
Find this compound or compounds like it in BindingDB:
Activity Spreadsheet -- Enzyme Inhibition Constant Data from BindingDB
Found 1 hit for monomerid = 501672
TargetDihydroorotate dehydrogenase (quinone), mitochondrial(Homo sapiens (Human))
Merck Patent
US Patent
LigandPNGBDBM501672(US11028054, Example 117)
Affinity DataIC50:  5.5nM. Assay description: Reagents used: L-Dihydroorotic acid, Sigma, D7128, 2,6-Dichloroindophenol sodium salt hydrate, sigma, D1878 Dimethyl sulfoxide (DMSO), spectroscopic ...
Ligand InfoPC cidPC sid
In DepthDetails US Patent