BDBM50167312 1-Benzo[b]thiophen-2-ylmethyl-4-chloro-1H-indole-2,3-dione::CHEMBL365469::acs.jmedchem.1c00409_ST.531
SMILES Clc1cccc2N(Cc3cc4ccccc4s3)C(=O)C(=O)c12
InChI Key InChIKey=VCHRPHJPXICPGC-UHFFFAOYSA-N
Data  2 IC50
  Tab Delimited (TSV)   2D SDfile   Computed 3D by Vconf -m prep SDfile
Find this compound or compounds like it in BindingDB:
Activity Spreadsheet -- Enzyme Inhibition Constant Data from BindingDB
Found 2 hits for monomerid = 50167312
TargetReplicase polyprotein 1ab(Human SARS coronavirus (SARS-CoV) (Severe acute re...)
Michigan State University
LigandPNGBDBM50167312(1-Benzo[b]thiophen-2-ylmethyl-4-chloro-1H-indole-2...)
Affinity DataIC50:  1.12E+4nM. Assay description: This is a review article. Please point to the original journal.
In DepthDetails ArticlePubMed
TargetReplicase polyprotein 1a(Human SARS coronavirus (SARS-CoV))
Development Center For Biotechnology
Curated by ChEMBL
LigandPNGBDBM50167312(1-Benzo[b]thiophen-2-ylmethyl-4-chloro-1H-indole-2...)
Affinity DataIC50:  1.12E+4nM. Assay description: In vitro inhibitory concentration against SARS coronavirus main protease (SARS CoV 3C-like protease)
In DepthDetails ArticlePubMed