BDBM501682 US11028058, Compound 1.304
SMILES Cn1ccc(n1)-c1nc(N)cnc1-c1cc(Cl)c2[nH]ncc2c1
InChI Key InChIKey=CQVKACDCKIDJPQ-UHFFFAOYSA-N
Data  1 IC50
  Tab Delimited (TSV)   2D SDfile   Computed 3D by Vconf -m prep SDfile
Find this compound or compounds like it in BindingDB:
Activity Spreadsheet -- Enzyme Inhibition Constant Data from BindingDB
Found 1 hit for monomerid = 501682
TargetAdenosine receptor A2a(Homo sapiens (Human))
Nuvation Bio
US Patent
LigandPNGBDBM501682(US11028058, Compound 1.304)
Affinity DataIC50:  9nM. Assay description: For the A2A adenosine receptor radioligand binding assay, the following modifications were made to the general protocol. GF/C filters (Perkin Elmer, ...
Ligand InfoPC cidPC sid
In DepthDetails US Patent