BDBM501684 US11028058, Compound 1.309
SMILES Cn1ccc(n1)-c1nc(N)c(nc1-c1cc(Cl)c2ncccc2c1)C#N
InChI Key InChIKey=CSJLPCOUSBKNRV-UHFFFAOYSA-N
Data  1 IC50
  Tab Delimited (TSV)   2D SDfile   Computed 3D by Vconf -m prep SDfile
Find this compound or compounds like it in BindingDB:
Activity Spreadsheet -- Enzyme Inhibition Constant Data from BindingDB
Found 1 hit for monomerid = 501684
TargetAdenosine receptor A2a(Homo sapiens (Human))
Nuvation Bio
US Patent
LigandPNGBDBM501684(US11028058, Compound 1.309)
Affinity DataIC50:  1.60nM. Assay description: For the A2A adenosine receptor radioligand binding assay, the following modifications were made to the general protocol. GF/C filters (Perkin Elmer, ...
Ligand InfoPC cidPC sid
In DepthDetails US Patent