BDBM50169038 CHEMBL3804841
SMILES COc1cc(cc(c1)-c1ccc(cc1)C#N)C(=O)N[C@H]1C(O)O[C@H](CNS(=O)(=O)c2cccc(Cl)c2Cl)[C@@H](O)[C@@H]1O
InChI Key InChIKey=HBGMCCARHCLDCH-AREUJWMLSA-N
Data  2 IC50
  Tab Delimited (TSV)   2D SDfile   Computed 3D by Vconf -m prep SDfile
Find this compound or compounds like it in BindingDB:
Activity Spreadsheet -- Enzyme Inhibition Constant Data from BindingDB
Found 2 hits for monomerid = 50169038
TargetHexokinase-2(Homo sapiens (Human))
Glaxosmithkline
Curated by ChEMBL
LigandPNGBDBM50169038(CHEMBL3804841)
Affinity DataIC50:  25nM. Assay description: Inhibition of His-tagged human HK2 (17 to 916 residues) expressed in Escherichia coli BL21(DE3) using glucose as substrate after 45 mins by ADP-glo a...
In DepthDetails ArticlePubMed
TargetHexokinase-1(Homo sapiens (Human))
Glaxosmithkline
Curated by ChEMBL
LigandPNGBDBM50169038(CHEMBL3804841)
Affinity DataIC50:  7.90nM. Assay description: Inhibition of His-tagged human HK1 (11 to 917 residues) expressed in Escherichia coli BL21(DE3) using glucose as substrate after 45 mins by ADP-glo a...
In DepthDetails ArticlePubMed