BDBM50169183 (S)-6-Amino-2-{(S)-3-phenyl-2-[((S)-pyrrolidine-2-carbonyl)-amino]-propionylamino}-hexanoic acid::CHEMBL426809
SMILES NCCCC[C@H](NC(=O)[C@H](Cc1ccccc1)NC(=O)[C@@H]1CCCN1)C(O)=O
InChI Key InChIKey=SWRNSCMUXRLHCR-ULQDDVLXSA-N
Data  2 KI
  Tab Delimited (TSV)   2D SDfile   Computed 3D by Vconf -m prep SDfile
Find this compound or compounds like it in BindingDB:
Activity Spreadsheet -- Enzyme Inhibition Constant Data from BindingDB
Found 2 hits for monomerid = 50169183
TargetSolute carrier family 15 member 2(Homo sapiens (Human))
Universit£
Curated by ChEMBL
LigandPNGBDBM50169183((S)-6-Amino-2-{(S)-3-phenyl-2-[((S)-pyrrolidine-2-...)
Affinity DataKi:  9.00E+5nM. Assay description: Binding affinity to human PepT2 in SKTP cells
In DepthDetails ArticlePubMed
TargetSolute carrier family 15 member 1(Homo sapiens (Human))
Martin-Luther-University Halle-Wittenberg
Curated by ChEMBL
LigandPNGBDBM50169183((S)-6-Amino-2-{(S)-3-phenyl-2-[((S)-pyrrolidine-2-...)
Affinity DataKi:  2.00E+6nM. Assay description: Binding affinity against membrane transport protein PEPT1 in human Caco-2 cells
In DepthDetails ArticlePubMed