BDBM501692 1-(3-((5-(2-(Dimethylamino)ethoxy)-7-methyl-9-oxo-9H-xanthen-3-yl)oxy)phenyl)-3-phenylurea::US11028064, Example 6
SMILES CN(C)CCOc1cc(C)cc2c1oc1cc(Oc3cccc(NC(=O)Nc4ccccc4)c3)ccc1c2=O
InChI Key InChIKey=YQHJSHUOKMQLOP-UHFFFAOYSA-N
Data  2 IC50
  Tab Delimited (TSV)   2D SDfile   Computed 3D by Vconf -m prep SDfile
Find this compound or compounds like it in BindingDB:
Activity Spreadsheet -- Enzyme Inhibition Constant Data from BindingDB
Found 2 hits for monomerid = 501692
TargetVascular endothelial growth factor receptor 2(Homo sapiens (Human))
Auckland Uniservices
US Patent
LigandPNGBDBM501692(1-(3-((5-(2-(Dimethylamino)ethoxy)-7-methyl-9-oxo-...)
Affinity DataIC50: <100nM. Assay description: IC50 values were determined using the Z′-LYTEŽ activity assay, with ATP concentration used at Km app for the specific assay (500 μM ATP fo...
Ligand InfoPC cidPC sid
In DepthDetails US Patent
TargetMacrophage colony-stimulating factor 1 receptor(Homo sapiens (Human))
Auckland Uniservices
US Patent
LigandPNGBDBM501692(1-(3-((5-(2-(Dimethylamino)ethoxy)-7-methyl-9-oxo-...)
Affinity DataIC50: <100nM. Assay description: IC50 values were determined using the Z′-LYTEŽ activity assay, with ATP concentration used at Km app for the specific assay (500 μM ATP fo...
Ligand InfoPC cidPC sid
In DepthDetails US Patent