BDBM50169592 2-Ethyl-7-(2,4,6-trimethyl-phenyl)-6,7-dihydro-5H-imidazo[1,2-a]imidazole-3-carboxylic acid (2-cyclopropyl-ethyl)-ethyl-amide::CHEMBL181287
SMILES CCN(CCC1CC1)C(=O)c1c(CC)nc2N(CCn12)c1c(C)cc(C)cc1C
InChI Key InChIKey=ZCRGIWQCPZUCIE-UHFFFAOYSA-N
Data  1 KI
  Tab Delimited (TSV)   2D SDfile   Computed 3D by Vconf -m prep SDfile
Find this compound or compounds like it in BindingDB:
Activity Spreadsheet -- Enzyme Inhibition Constant Data from BindingDB
Found 1 hit for monomerid = 50169592
TargetCorticotropin-releasing factor receptor 1(Homo sapiens (Human))
Pharmaceutical Research Institute
Curated by ChEMBL
LigandPNGBDBM50169592(2-Ethyl-7-(2,4,6-trimethyl-phenyl)-6,7-dihydro-5H-...)
Affinity DataKi:  610nM. Assay description: Displacement of [125I]-Tyr-o- CRF from human corticotropin releasing factor receptor 1 expressed in IMR-32 cells
In DepthDetails ArticlePubMed