BDBM50169850 5,6-Dimethoxy-2-(4-pyrrolidin-1-ylmethyl-phenoxy)-indan-1-one::CHEMBL180483
SMILES COc1cc2CC(Oc3ccc(CN4CCCC4)cc3)C(=O)c2cc1OC
InChI Key InChIKey=NHKALDYCLFCPIU-UHFFFAOYSA-N
Data  1 KI  4 IC50
  Tab Delimited (TSV)   2D SDfile   Computed 3D by Vconf -m prep SDfile
Find this compound or compounds like it in BindingDB:
Activity Spreadsheet -- Enzyme Inhibition Constant Data from BindingDB
Found 5 hits for monomerid = 50169850
TargetAcetylcholinesterase(Homo sapiens (Human))TBA
LigandPNGBDBM50169850(5,6-Dimethoxy-2-(4-pyrrolidin-1-ylmethyl-phenoxy)-...)
Affinity DataKi:  257nM. Assay description: Binding affinity to acetylcholinesterase (unknown origin)
In DepthDetails Article
TargetCarboxylic ester hydrolase(Rattus norvegicus (rat))
Zhejiang University
Curated by ChEMBL
LigandPNGBDBM50169850(5,6-Dimethoxy-2-(4-pyrrolidin-1-ylmethyl-phenoxy)-...)
Affinity DataIC50:  8.43E+4nM. Assay description: In vitro inhibitory concentration against butyrylcholinesterase was determined using rat serum homogenate
In DepthDetails ArticlePubMed
TargetAcetylcholinesterase(Rattus norvegicus (rat))TBA
LigandPNGBDBM50169850(5,6-Dimethoxy-2-(4-pyrrolidin-1-ylmethyl-phenoxy)-...)
Affinity DataIC50:  50nM. Assay description: Inhibition of acetylcholinesterase in Rattus norvegicus (rat) cortex by Ellman method
In DepthDetails Article
TargetAcetylcholinesterase(Homo sapiens (Human))TBA
LigandPNGBDBM50169850(5,6-Dimethoxy-2-(4-pyrrolidin-1-ylmethyl-phenoxy)-...)
Affinity DataIC50:  50nM. Assay description: Inhibition of AChE
In DepthDetails ArticlePubMed
TargetAcetylcholinesterase(Rattus norvegicus (rat))TBA
LigandPNGBDBM50169850(5,6-Dimethoxy-2-(4-pyrrolidin-1-ylmethyl-phenoxy)-...)
Affinity DataIC50:  50nM. Assay description: In vitro inhibitory concentration against rat cortex acetylcholinesterase
In DepthDetails ArticlePubMed