BDBM50169853 2-(3-Diethylaminomethyl-phenoxy)-5,6-dimethoxy-indan-1-one::CHEMBL180645
SMILES CCN(CC)Cc1cccc(OC2Cc3cc(OC)c(OC)cc3C2=O)c1
InChI Key InChIKey=RPSNBPHMKGJZHG-UHFFFAOYSA-N
Data  1 KI  3 IC50
  Tab Delimited (TSV)   2D SDfile   Computed 3D by Vconf -m prep SDfile
Find this compound or compounds like it in BindingDB:
Activity Spreadsheet -- Enzyme Inhibition Constant Data from BindingDB
Found 4 hits for monomerid = 50169853
TargetAcetylcholinesterase(Homo sapiens (Human))TBA
LigandPNGBDBM50169853(2-(3-Diethylaminomethyl-phenoxy)-5,6-dimethoxy-ind...)
Affinity DataKi:  1.59E+3nM. Assay description: Binding affinity to acetylcholinesterase (unknown origin)
In DepthDetails Article
TargetAcetylcholinesterase(Rattus norvegicus (rat))TBA
LigandPNGBDBM50169853(2-(3-Diethylaminomethyl-phenoxy)-5,6-dimethoxy-ind...)
Affinity DataIC50:  2.28E+3nM. Assay description: Inhibition of acetylcholinesterase in Rattus norvegicus (rat) cortex by Ellman method
In DepthDetails Article
TargetCarboxylic ester hydrolase(Rattus norvegicus (rat))
Zhejiang University
Curated by ChEMBL
LigandPNGBDBM50169853(2-(3-Diethylaminomethyl-phenoxy)-5,6-dimethoxy-ind...)
Affinity DataIC50:  1.90E+5nM. Assay description: In vitro inhibitory concentration against butyrylcholinesterase was determined using rat serum homogenate
In DepthDetails ArticlePubMed
TargetAcetylcholinesterase(Rattus norvegicus (rat))TBA
LigandPNGBDBM50169853(2-(3-Diethylaminomethyl-phenoxy)-5,6-dimethoxy-ind...)
Affinity DataIC50:  2.28E+3nM. Assay description: In vitro inhibitory concentration against rat cortex acetylcholinesterase
In DepthDetails ArticlePubMed